sondya.boberg
Posts: 35
Joined: Sun Aug 20, 2017 11:19 pm

[SOLVED] Dolphin Development Version Issue

Sun Nov 19, 2017 4:20 am

I'm not sure if this is a Dolphin issue, but here you go.

Code: Select all

CMakeFiles/dolphin-emu.dir/ISOProperties/ISOProperties.cpp.o: In function `CISOProperties::OnShowDefaultConfig(wxCommandEvent&)':
/home/sondya/.scripts/dolphin/Source/Core/DolphinWX/ISOProperties/ISOProperties.cpp:760: undefined reference to `ConfigLoaders::GetGameIniFilenames(std::__cxx11::basic_string<char, std::char_traits<char>, std::allocator<char> > const&, gtl::optional<unsigned short>)'
CMakeFiles/dolphin-emu.dir/ISOProperties/ISOProperties.cpp.o: In function `CISOProperties::CreateGUIControls()':
/home/sondya/.scripts/dolphin/Source/Core/DolphinWX/ISOProperties/ISOProperties.cpp:451: undefined reference to `ConfigLoaders::GetGameIniFilenames(std::__cxx11::basic_string<char, std::char_traits<char>, std::allocator<char> > const&, gtl::optional<unsigned short>)'
CMakeFiles/dolphin-emu.dir/ISOProperties/ISOProperties.cpp.o: In function `CISOProperties::CISOProperties(GameListItem const&, wxWindow*, int, wxString const&, wxPoint const&, wxSize const&, long)':
/home/sondya/.scripts/dolphin/Source/Core/DolphinWX/ISOProperties/ISOProperties.cpp:207: undefined reference to `SConfig::LoadDefaultGameIni(std::__cxx11::basic_string<char, std::char_traits<char>, std::allocator<char> > const&, gtl::optional<unsigned short>)'
/home/sondya/.scripts/dolphin/Source/Core/DolphinWX/ISOProperties/ISOProperties.cpp:208: undefined reference to `SConfig::LoadLocalGameIni(std::__cxx11::basic_string<char, std::char_traits<char>, std::allocator<char> > const&, gtl::optional<unsigned short>)'
CMakeFiles/dolphin-emu.dir/FrameTools.cpp.o: In function `std::_MakeUniq<BootParameters>::__single_object std::make_unique<BootParameters, BootParameters::IPL>(BootParameters::IPL&&)':
/usr/include/c++/6.4.0/bits/unique_ptr.h:791: undefined reference to `BootParameters::BootParameters(mpark::variant<BootParameters::Disc, BootParameters::Executable, DiscIO::WiiWAD, BootParameters::NANDTitle, BootParameters::IPL, BootParameters::DFF>&&)'
/usr/include/c++/6.4.0/bits/unique_ptr.h:791: undefined reference to `BootParameters::BootParameters(mpark::variant<BootParameters::Disc, BootParameters::Executable, DiscIO::WiiWAD, BootParameters::NANDTitle, BootParameters::IPL, BootParameters::DFF>&&)'
/usr/include/c++/6.4.0/bits/unique_ptr.h:791: undefined reference to `BootParameters::BootParameters(mpark::variant<BootParameters::Disc, BootParameters::Executable, DiscIO::WiiWAD, BootParameters::NANDTitle, BootParameters::IPL, BootParameters::DFF>&&)'
CMakeFiles/dolphin-emu.dir/FrameTools.cpp.o: In function `std::_MakeUniq<BootParameters>::__single_object std::make_unique<BootParameters, BootParameters::NANDTitle>(BootParameters::NANDTitle&&)':
/usr/include/c++/6.4.0/bits/unique_ptr.h:791: undefined reference to `BootParameters::BootParameters(mpark::variant<BootParameters::Disc, BootParameters::Executable, DiscIO::WiiWAD, BootParameters::NANDTitle, BootParameters::IPL, BootParameters::DFF>&&)'
CMakeFiles/dolphin-emu.dir/ISOFile.cpp.o: In function `GameListItem::EmuStateChanged()':
/home/sondya/.scripts/dolphin/Source/Core/DolphinWX/ISOFile.cpp:159: undefined reference to `SConfig::LoadGameIni(std::__cxx11::basic_string<char, std::char_traits<char>, std::allocator<char> > const&, gtl::optional<unsigned short>)'
../Core/libcore.a(ConfigManager.cpp.o): In function `SConfig::SetRunningGameMetadata(IOS::ES::TMDReader const&)':
/home/sondya/.scripts/dolphin/Source/Core/Core/ConfigManager.cpp:695: undefined reference to `DVDInterface::UpdateRunningGameMetadata(std::optional<unsigned long>)'
/home/sondya/.scripts/dolphin/Source/Core/Core/ConfigManager.cpp:695: undefined reference to `DVDInterface::UpdateRunningGameMetadata(std::optional<unsigned long>)'
/home/sondya/.scripts/dolphin/Source/Core/Core/ConfigManager.cpp:695: undefined reference to `DVDInterface::UpdateRunningGameMetadata(std::optional<unsigned long>)'
collect2: error: ld returned 1 exit status
make[2]: *** [Source/Core/DolphinWX/CMakeFiles/dolphin-emu.dir/build.make:2371: Binaries/dolphin-emu] Error 1
make[1]: *** [CMakeFiles/Makefile2:1294: Source/Core/DolphinWX/CMakeFiles/dolphin-emu.dir/all] Error 2
make: *** [Makefile:152: all] Error 2
Last edited by sondya.boberg on Wed Dec 13, 2017 4:47 pm, edited 1 time in total.
Computer: Dell Inspiron 3250
OS: Solus Budgie
CPU: Intel Core i5-6400 @ 3.30 GHz, RAM: 8 GB, GPU: Intel(R) HD Graphics 530, HDD: 1 TB

sondya.boberg
Posts: 35
Joined: Sun Aug 20, 2017 11:19 pm

Re: Dolphin Development Version Issue

Wed Dec 13, 2017 3:26 pm

I am still having this issue. Can ANYONE help me here?

Newest error:

Code: Select all

[ 85%] Linking CXX executable ../../../Binaries/dolphin-emu
../Core/libcore.a(WiiUtils.cpp.o): In function `WiiUtils::OnlineSystemUpdater::DownloadContent(std::__cxx11::basic_string<char, std::char_traits<char>, std::allocator<char> > const&, WiiUtils::SystemUpdater::TitleInfo const&, unsigned int)':
/home/sondya/.scripts/dolphin/Source/Core/Core/WiiUtils.cpp:550: undefined reference to `Common::HttpRequest::Get(std::__cxx11::basic_string<char, std::char_traits<char>, std::allocator<char> > const&, std::map<std::__cxx11::basic_string<char, std::char_traits<char>, std::allocator<char> >, std::optional<std::__cxx11::basic_string<char, std::char_traits<char>, std::allocator<char> > >, std::less<std::__cxx11::basic_string<char, std::char_traits<char>, std::allocator<char> > >, std::allocator<std::pair<std::__cxx11::basic_string<char, std::char_traits<char>, std::allocator<char> > const, std::optional<std::__cxx11::basic_string<char, std::char_traits<char>, std::allocator<char> > > > > > const&)'
../Core/libcore.a(WiiUtils.cpp.o): In function `WiiUtils::OnlineSystemUpdater::DownloadTicket(std::__cxx11::basic_string<char, std::char_traits<char>, std::allocator<char> > const&, WiiUtils::SystemUpdater::TitleInfo const&)':
/home/sondya/.scripts/dolphin/Source/Core/Core/WiiUtils.cpp:533: undefined reference to `Common::HttpRequest::Get(std::__cxx11::basic_string<char, std::char_traits<char>, std::allocator<char> > const&, std::map<std::__cxx11::basic_string<char, std::char_traits<char>, std::allocator<char> >, std::optional<std::__cxx11::basic_string<char, std::char_traits<char>, std::allocator<char> > >, std::less<std::__cxx11::basic_string<char, std::char_traits<char>, std::allocator<char> > >, std::allocator<std::pair<std::__cxx11::basic_string<char, std::char_traits<char>, std::allocator<char> > const, std::optional<std::__cxx11::basic_string<char, std::char_traits<char>, std::allocator<char> > > > > > const&)'
../Core/libcore.a(WiiUtils.cpp.o): In function `WiiUtils::OnlineSystemUpdater::DownloadTMD(std::__cxx11::basic_string<char, std::char_traits<char>, std::allocator<char> > const&, WiiUtils::SystemUpdater::TitleInfo const&)':
/home/sondya/.scripts/dolphin/Source/Core/Core/WiiUtils.cpp:508: undefined reference to `Common::HttpRequest::Get(std::__cxx11::basic_string<char, std::char_traits<char>, std::allocator<char> > const&, std::map<std::__cxx11::basic_string<char, std::char_traits<char>, std::allocator<char> >, std::optional<std::__cxx11::basic_string<char, std::char_traits<char>, std::allocator<char> > >, std::less<std::__cxx11::basic_string<char, std::char_traits<char>, std::allocator<char> > >, std::allocator<std::pair<std::__cxx11::basic_string<char, std::char_traits<char>, std::allocator<char> > const, std::optional<std::__cxx11::basic_string<char, std::char_traits<char>, std::allocator<char> > > > > > const&)'
../Core/libcore.a(WiiUtils.cpp.o): In function `WiiUtils::OnlineSystemUpdater::GetSystemTitles()':
/home/sondya/.scripts/dolphin/Source/Core/Core/WiiUtils.cpp:345: undefined reference to `Common::HttpRequest::Post(std::__cxx11::basic_string<char, std::char_traits<char>, std::allocator<char> > const&, std::__cxx11::basic_string<char, std::char_traits<char>, std::allocator<char> > const&, std::map<std::__cxx11::basic_string<char, std::char_traits<char>, std::allocator<char> >, std::optional<std::__cxx11::basic_string<char, std::char_traits<char>, std::allocator<char> > >, std::less<std::__cxx11::basic_string<char, std::char_traits<char>, std::allocator<char> > >, std::allocator<std::pair<std::__cxx11::basic_string<char, std::char_traits<char>, std::allocator<char> > const, std::optional<std::__cxx11::basic_string<char, std::char_traits<char>, std::allocator<char> > > > > > const&)'
../Common/libcommon.a(Analytics.cpp.o): In function `Common::HttpAnalyticsBackend::Send(std::__cxx11::basic_string<char, std::char_traits<char>, std::allocator<char> >)':
/home/sondya/.scripts/dolphin/Source/Core/Common/Analytics.cpp:191: undefined reference to `Common::HttpRequest::Post(std::__cxx11::basic_string<char, std::char_traits<char>, std::allocator<char> > const&, std::__cxx11::basic_string<char, std::char_traits<char>, std::allocator<char> > const&, std::map<std::__cxx11::basic_string<char, std::char_traits<char>, std::allocator<char> >, std::optional<std::__cxx11::basic_string<char, std::char_traits<char>, std::allocator<char> > >, std::less<std::__cxx11::basic_string<char, std::char_traits<char>, std::allocator<char> > >, std::allocator<std::pair<std::__cxx11::basic_string<char, std::char_traits<char>, std::allocator<char> > const, std::optional<std::__cxx11::basic_string<char, std::char_traits<char>, std::allocator<char> > > > > > const&)'
collect2: error: ld returned 1 exit status
make[2]: *** [Source/Core/DolphinWX/CMakeFiles/dolphin-emu.dir/build.make:2371: Binaries/dolphin-emu] Error 1
make[1]: *** [CMakeFiles/Makefile2:1294: Source/Core/DolphinWX/CMakeFiles/dolphin-emu.dir/all] Error 2
make: *** [Makefile:152: all] Error 2
Computer: Dell Inspiron 3250
OS: Solus Budgie
CPU: Intel Core i5-6400 @ 3.30 GHz, RAM: 8 GB, GPU: Intel(R) HD Graphics 530, HDD: 1 TB

sondya.boberg
Posts: 35
Joined: Sun Aug 20, 2017 11:19 pm

Re: Dolphin Development Version Issue

Wed Dec 13, 2017 4:47 pm

I solved the issue. I just deleted the original Dolphin files and redownloaded them.
Computer: Dell Inspiron 3250
OS: Solus Budgie
CPU: Intel Core i5-6400 @ 3.30 GHz, RAM: 8 GB, GPU: Intel(R) HD Graphics 530, HDD: 1 TB

Return to “Testing”